{"text_format":"1","workbook":"xlsx","n_sheets":4,"sheets":["Support","Paraiska","Issimokejimo grafikas","Darbu Sarasas"],"not_rendered":{"charts":0,"images":1,"macros":1,"external_links":0,"defined_names":23,"comments":0,"pivot_tables":0},"unopened":[],"bounds":{"document_bytes":16777216,"sheet_cells":100000,"rows_first":2000,"rows_last":500,"rows_between":2000,"halvings":0,"cell_chars":16384,"cell_head_chars":4096},"cells_cut":0,"cells_raw":0,"read":"whole","date_system":"1900"}

{"sheet":"Support","index":0,"n_rows":254,"n_cols":31,"rows_kept":254,"cut":false,"hidden":true,"merged":[[77,1,81,1],[77,2,81,2],[77,3,81,3],[36,1,40,1],[36,2,40,2],[36,3,40,3],[56,1,60,1],[56,2,60,2],[56,3,60,3],[128,1,132,1],[128,2,132,2],[128,3,132,3],[148,1,152,1],[148,2,152,2],[148,3,152,3],[169,1,173,1],[169,2,173,2],[169,3,173,3],[184,1,184,6],[186,1,186,6],[180,1,180,3],[187,1,187,3],[187,4,187,6],[188,1,188,3],[188,4,188,6],[189,1,189,3],[189,4,189,6],[192,1,192,6],[193,1,193,3],[193,4,193,6],[194,1,194,3],[194,4,194,6],[195,1,195,3],[195,4,195,6],[198,1,198,6],[199,1,199,3],[199,4,199,6],[200,1,200,3],[200,4,200,6],[201,1,201,3],[201,4,201,6],[204,1,204,6],[218,1,218,3],[205,1,205,3],[205,4,205,6],[206,1,206,3],[206,4,206,6],[207,1,207,3],[207,4,207,6]]}
[null,"Pasirinkimas"]
[null,null,null,null,null,null,null,null,null,null,null,null,null,null,null,null,null,null,null,null,null,null,null,null,null,null,"Darbo tipai, kuriems niekada netaikomas nei garantinis sulaikymas, nei draudimas",null,null,"Darbas #1","Darbas #2"]
["PVM moketojas","PVM moketojas - PVM neapmokestinama veikla (ne rangos darbai)","Ne PVM moketojas - rangos darbai","Ne PVM moketojas - ne rangos darbai",null,"PVM moketojasTAIP","OK","PVM moketojas",1.2,1.21,null,null,null,null,null,null,null,null,null,null,null,null,null,null,null,null,"Pasirinkti darbo tipą","NE","Ar pasirinktas vienas iš šių darbo tipų?",{"$f":"IF(OR(Paraiska!$B$27=Support!$AA$4,Paraiska!$B$27=Support!$AA$5,Paraiska!$B$27=Support!$AA$6,Paraiska!$B$27=Support!$AA$7,Paraiska!$B$27=Support!$AA$8,Paraiska!$B$27=Support!$AA$9,Paraiska!$B$27=Support!AA10,Paraiska!$B$27=Support!$AA$11),\"TAIP\",\"NE\")","v":"NE"},{"$f":"IF(OR(Paraiska!$E$27=Support!$AA$4,Paraiska!$E$27=Support!$AA$5,Paraiska!$E$27=Support!$AA$6,Paraiska!$E$27=Support!$AA$7,Paraiska!$E$27=Support!$AA$8,Paraiska!$E$27=Support!$AA$9,Paraiska!$E$27=Support!AA10,Paraiska!$E$27=Support!$AA$11),\"TAIP\",\"NE\")","v":"NE"}]
["NE","NE","NE","NE",null,"PVM moketojasNE","OK","PVM moketojas - PVM neapmokestinama veikla (ne rangos darbai)",1.2,1.21,null,null,null,null,null,null,null,null,null,null,null,null,null,null,null,null,"Kondicionavimo sistemų papildymas šaldymo skysčiu","NE"]
["TAIP",null,null,null,null,"Ne PVM moketojas - rangos darbaiNE","OK","Ne PVM moketojas - rangos darbai",{"$f":"1.242","v":1.242},1,null,null,null,null,null,null,null,null,null,null,null,null,null,null,null,null,"Pastato konstrukcijų būklės vertinimas","NE"]
[null,null,null,null,null,"Ne PVM moketojas - rangos darbaiTAIP","NE","Ne PVM moketojas - ne rangos darbai",1.5,1,null,null,null,null,null,null,null,null,null,null,null,null,null,null,null,null,"Projektavimo darbai (išorės sienos (fasadai), balkonai, perdangos)","NE"]
["TAIP","NE","Minimali kaina kv.m., EUR",0.5,null,"PVM moketojas - PVM neapmokestinama veikla (ne rangos darbai)NE","OK",null,null,null,null,null,null,null,null,null,null,null,null,null,null,null,null,null,null,null,"Projektavimo darbai (šalto vandens, buitinių ir lietaus nuotekų sistemos)","NE"]
["12 men. (1m.)","Be issimokejimo termino","Minimali nemokumo riba",0.05,null,"PVM moketojas - PVM neapmokestinama veikla (ne rangos darbai)TAIP","NE",null,null,null,null,null,null,null,null,null,null,null,null,null,null,null,null,null,null,null,"Projektavimo darbai (šildymo ir karšto vandens sistemos, šilumos punktai)","NE"]
["18 men. (1.5m.)",null,null,null,null,"Ne PVM moketojas - ne rangos darbaiNE","OK",null,null,null,null,null,null,null,null,null,null,null,null,null,null,null,null,null,null,null,"Projektavimo darbai (stogai)","NE"]
["24 men. (2m.)",null,null,null,null,"Ne PVM moketojas - ne rangos darbaiTAIP","NE",null,null,null,null,null,null,null,null,null,null,null,null,null,null,null,null,null,null,null,"Projektavimo darbai ( elektros tinklai ir įrenginiai)","NE"]
["30 men. (2.5m.)",null,null,null,null,null,null,null,null,null,null,null,null,null,null,null,null,null,null,null,null,null,null,null,null,null,"Statinių konstrukcijų techninė apžiūra, tyrimai, periodinis patikrinimas, ekspertizės","NE"]
["36 men. (3m.)",null,null,null,null,"Ne PVM moketojas - ne rangos darbai VS kaupiamosios ir kiti avansai"]
["42 men. (3.5m.)",null,null,null,null,{"$f":"IFERROR(IF(Paraiska!B11=Support!H6,IF(Paraiska!B9=\"\",(Paraiska!B10+Paraiska!E10+(Paraiska!B10+Paraiska!E10)*Support!B18*1.21)/(Paraiska!B31+Paraiska!B32),(Paraiska!B9+Paraiska!E9+(Paraiska!B9+Paraiska!E9)*Support!B18*1.21)/(Paraiska!B31+Paraiska!B32)),\"\"),\"\")","v":""},"(kai <1, reiškia, kad kaupiamųjų ir kitų avansų yra daugiau nei Rangovo išrašomos sąskaitos be išsimokėjimo)"]
["48 men. (4m.)",null,null,null,null,null,null,null,null,null,null,null,null,null,"Pirkimai","CS2021P"]
[null,null,null,null,null,null,null,null,null,null,null,null,null,null,"Bendra","CSSE48",null,0.53023758099352047,7.559395248380131E-2,0.39416846652267828]
[null,"1-5",null,6,null,7,null,null,null,null,8,null,null,null,null,null,null,"1-5","6","7",null,"Bendras","Rėžio, į kurį patenka suma, numeris"]
["issimokejimo terminas","Mokestis, %","Min. mokestis, EUR","Mokestis, %","Min. mokestis, EUR","Mokestis, %","Faktoringo kaina","Garantija","Reiksmes","Menesiai","Nemokumo koef",null,null,null,"Nuo","Iki","Marža","Mokestis, %","Mokestis, %","Mokestis, %"]
["Be issimokejimo termino",0.25,0,0,0,0,0,0.04,"NE",1,0,null,null,1,1,500,0.25,{"$f":"Q18*$R$15","v":0.13255939524838012},{"$f":"Q18*$S$15","v":1.8898488120950328E-2},{"$f":"Q18*$T$15","v":9.8542116630669571E-2},null,{"$f":"IF(OR(AND(Paraiska!B$6 = 1, Paraiska!B$9=\"\"),AND(Paraiska!B$6 = 2, Paraiska!B$9=\"\", Paraiska!E$9=\"\")),IF(AND(Paraiska!B$10+Paraiska!E$10>=Support!O18, Paraiska!B$10+Paraiska!E$10<=Support!P18),1,0), IF(AND(Paraiska!B$9+Paraiska!E$9>=Support!O18, Paraiska!B$9+Paraiska!E$9 <=Support!P18), 1, 0))","v":0},{"$f":"SUMPRODUCT(N18:N25, V18:V25)","v":6}]
["12 men. (1m.)",0.13,300,0.02,100,0.05,7.6316491272950537E-2,0.04,"TAIP",12,0.5,null,null,2,500,1000,0.25,{"$f":"Q19*$R$15","v":0.13255939524838012},{"$f":"Q19*$S$15","v":1.8898488120950328E-2},{"$f":"Q19*$T$15","v":9.8542116630669571E-2},null,{"$f":"IF(OR(AND(Paraiska!B$6 = 1, Paraiska!B$9=\"\"),AND(Paraiska!B$6 = 2, Paraiska!B$9=\"\", Paraiska!E$9=\"\")),IF(AND(Paraiska!B$10+Paraiska!E$10>Support!O19, Paraiska!B$10+Paraiska!E$10<=Support!P19),1,0), IF(AND(Paraiska!B$9+Paraiska!E$9>Support!O19, Paraiska!B$9+Paraiska!E$9 <=Support!P19), 1, 0))","v":0}]
["18 men. (1.5m.)",0.121,300,0.02,100,7.0999999999999994E-2,0.10270034785286498,0.04,"TAIP",18,0.5,null,null,3,1000,5000,0.25,0.13255939524838012,1.8898488120950328E-2,9.8542116630669571E-2,null,{"$f":"IF(OR(AND(Paraiska!B$6 = 1, Paraiska!B$9=\"\"),AND(Paraiska!B$6 = 2, Paraiska!B$9=\"\", Paraiska!E$9=\"\")),IF(AND(Paraiska!B$10+Paraiska!E$10>Support!O20, Paraiska!B$10+Paraiska!E$10<=Support!P20),1,0), IF(AND(Paraiska!B$9+Paraiska!E$9>Support!O20, Paraiska!B$9+Paraiska!E$9 <=Support!P20), 1, 0))","v":0}]
{"$rows_left_out":235}
{"sheet":"Paraiska","index":1,"n_rows":207,"n_cols":22,"rows_kept":207,"cut":false,"hidden":false,"merged":[[6,16,8,17],[202,8,202,10],[177,8,181,8],[177,9,181,9],[177,10,181,10],[195,8,195,10],[164,8,164,10],[137,8,137,10],[138,8,138,10],[139,8,139,10],[140,8,140,10],[141,8,141,10],[142,8,142,10],[143,8,143,10],[144,8,144,10],[145,8,145,10],[153,8,153,10],[146,8,146,10],[147,8,147,10],[148,8,148,10],[152,8,152,10],[154,8,154,10],[155,8,155,10],[186,8,186,10],[189,8,189,10],[192,8,192,10],[193,8,193,10],[194,8,194,10],[4,1,4,6],[201,8,201,10],[6,1,6,6],[6,8,6,10],[7,1,7,3],[7,4,7,6],[9,4,9,6],[8,8,8,10],[189,1,189,3],[189,4,189,6],[199,1,199,3],[177,1,181,1],[177,2,181,2],[177,3,181,3],[175,1,175,6],[186,1,186,6],[187,1,187,3],[187,4,187,6],[116,8,116,10],[112,8,112,10],[152,1,152,6],[148,1,148,6],[198,8,198,10],[177,4,181,4],[83,1,83,3],[141,1,141,6],[140,1,140,6],[139,1,139,6],[115,4,115,6],[113,1,113,6],[112,1,112,6],[85,1,85,3],[121,8,121,10],[120,8,120,10],[118,8,118,10],[110,1,110,6],[130,1,130,3],[130,4,130,6],[88,8,88,10],[134,1,134,6],[187,8,187,10],[188,8,188,10],[200,8,200,10],[199,8,199,10],[177,5,181,5],[177,6,181,6],[199,4,199,6],[200,4,200,6],[175,8,175,10],[131,8,131,10],[132,8,132,10],[133,8,133,10],[134,8,134,10],[135,8,135,10],[136,8,136,10],[155,4,155,6],[154,4,154,6],[153,4,153,6],[138,1,138,6],[137,1,137,6],[147,1,147,6],[146,1,146,6],[145,1,145,6],[144,1,144,6],[143,1,143,6],[188,1,188,3],[133,1,133,6],[202,1,202,3],[192,1,192,6],[193,1,193,3],[193,4,193,6],[194,1,194,3],[194,4,194,6],[195,1,195,3],[195,4,195,6],[198,1,198,6],[201,4,201,6],[202,4,202,6],[200,1,200,3],[201,1,201,3],[154,1,154,3],[155,1,155,3],[142,1,142,6],[136,1,136,6],[135,1,135,6],[153,1,153,3],[188,4,188,6],[3,8,3,10],[62,8,62,10],[58,8,58,10],[117,8,117,10],[114,8,114,10],[113,8,113,10],[110,8,110,10],[81,8,81,10],[80,8,80,10],[89,8,89,10],[9,8,9,10],[10,8,10,10],[11,8,11,10],[19,8,19,10],[28,8,28,10],[29,8,29,10],[7,8,7,10],[74,8,74,10],[75,8,75,10],[82,8,82,10],[76,8,76,10],[92,8,92,10],[111,8,111,10],[84,8,84,10],[23,1,23,6],[31,8,31,10],[33,1,33,6],[32,1,32,6],[39,8,39,10],[36,8,36,10],[37,8,37,10],[34,8,34,10],[35,8,35,10],[39,4,39,6],[25,8,25,10],[24,8,24,10],[23,8,23,10],[30,8,30,10],[38,4,38,6],[24,1,24,6],[92,4,92,6],[111,1,111,6],[68,8,68,10],[87,8,87,10],[71,8,71,10],[90,8,90,10],[86,8,86,10],[85,8,85,10],[32,8,32,10],[33,8,33,10],[91,1,91,3],[10,1,10,6],[21,1,21,6],[8,1,8,3],[26,4,26,6],[132,1,132,3],[89,1,89,3],[88,1,88,3],[87,1,87,3],[87,4,87,6],[101,1,101,3],[86,4,86,6],[121,1,121,6],[120,1,120,6],[118,1,118,6],[117,1,117,6],[116,1,116,6],[114,1,114,6],[131,1,131,6],[132,4,132,6],[92,1,92,3],[90,4,90,6],[89,4,89,6],[88,4,88,6],[90,1,90,3],[86,1,86,3],[77,1,77,3],[85,4,85,6],[31,1,31,6],[30,1,30,6],[29,1,29,6],[38,1,38,3],[84,1,84,3],[82,1,82,3],[36,1,36,6],[51,1,51,3],[51,4,51,6],[76,1,76,3],[70,1,70,3],[69,1,69,3],[77,4,77,6],[76,4,76,6],[75,4,75,6],[71,4,71,6],[70,4,70,6],[69,4,69,6],[0,1,0,6],[12,1,12,6],[20,1,20,6],[22,1,22,6],[58,4,58,6],[59,4,59,6],[81,1,81,3],[37,1,37,6],[68,1,68,6],[65,4,65,6],[39,1,39,3],[9,1,9,3],[11,1,11,3],[59,1,59,3],[58,1,58,3],[62,1,62,6],[81,4,81,6],[8,4,8,6],[11,4,11,6],[19,1,19,6],[80,1,80,6],[74,1,74,6],[3,1,3,6],[5,1,5,6],[40,11,40,19],[83,8,83,10],[91,8,91,10],[64,1,64,3],[75,1,75,3],[71,1,71,3],[84,4,84,6],[82,4,82,6],[65,8,65,10],[54,8,54,10],[70,8,70,10],[69,8,69,10],[64,8,64,10],[63,8,63,10],[57,8,57,10],[42,8,42,10],[56,8,56,10],[59,8,59,10],[40,8,40,10],[63,4,63,6],[63,1,63,3],[64,4,64,6],[77,8,77,10],[65,1,65,3],[20,8,20,10],[41,8,41,10],[28,1,28,6],[26,1,26,3],[54,1,54,6],[56,1,56,6],[57,4,57,6],[34,1,34,6],[41,1,41,6],[42,1,42,6],[35,1,35,6],[57,1,57,3],[27,1,27,6],[52,1,52,3],[40,1,40,6],[27,8,27,10],[38,8,38,10],[26,8,26,10],[22,8,22,10],[21,8,21,10],[25,1,25,3],[25,4,25,6],[52,4,52,6],[52,8,52,10]]}
[null,"Pildomi laukai"]
[]
[]
["PRADZIA","PILDOMA INDORMACIJA",null,null,null,null,null,null,"PILDOMA INDORMACIJA",null,null,null,null,null,null,null,null,null,null,null,null,"X"]
["AR PAGEIDAUJAMA GAUTI IŠSIMOKĖJIMĄ DARBAMS?","TAIP"]
["Įveskite skirtingų atliekamų darbų skaičių (skirtingų mišrių PVM arba garantijos taikymas)",1]
[null,"RANGOVO INFORMACIJA",null,null,null,null,null,null,"RANGOVO INFORMACIJA",null,null,null,null,null,null,null,"v20240301_V"]
[null,null,null,null,"Darbas #2",null,null,null,"Darbas #1 ir Darbas #2"]
["Rangovo siūloma suma, EUR be PVM",null,null,null,null,null,null,null,{"$f":"IF(SUM(B9:G9)=0,\"\",SUM(B9:G9))","v":""}]
["Prognozuojama Rangovo siūloma suma, EUR be PVM",50000,null,null,null,null,null,null,{"$f":"IF(SUM(B10:G10)=0,\"\",SUM(B10:G10))","v":50000}]
["Darbų vykdytojo PVM mokėtojo statusas","PVM moketojas",null,null,null,null,null,null,{"$f":"B11","v":"PVM moketojas"}]
["Ar taikomas atvirkštinis PVM? Reikšmė NE arba TAIP (galima tik kai rangovas yra PVM mokėtojas)",{"$f":"IFERROR(IF(OR(B11=\"PVM moketojas - PVM neapmokestinama veikla (ne rangos darbai)\",B11=\"Ne PVM moketojas - rangos darbai\",B11=\"Ne PVM moketojas - ne rangos darbai\"),\"NE\",IF(VLOOKUP(B27,'Darbu Sarasas'!$F$1:$H$55,3,FALSE)=\"Taikomas APVM\",\"TAIP\",\"NE\")),\"TAIP\")","v":"TAIP"},{"$f":"OFFSET(Support!$A$3,1,MATCH($B$11,Support!$A$3:'Support'!$D$3,0)-1,1,1)","v":"NE"},{"$f":"OFFSET(Support!$A$3,1,MATCH($B$11,Support!$A$3:'Support'!$D$3,0)-1,1,1)","v":"NE"},{"$f":"IFERROR(IF(OR(B11=\"PVM moketojas - PVM neapmokestinama veikla (ne rangos darbai)\",B11=\"Ne PVM moketojas - rangos darbai\",B11=\"Ne PVM moketojas - ne rangos darbai\"),\"NE\",IF(VLOOKUP(E27,'Darbu Sarasas'!$F$1:$H$53,3,FALSE)=\"Taikomas APVM\",\"TAIP\",\"NE\")),\"TAIP\")","v":"NE"},{"$f":"OFFSET(Support!$A$3,1,MATCH($B$11,Support!$A$3:'Support'!$D$3,0)-1,1,1)","v":"NE"},{"$f":"OFFSET(Support!$A$3,1,MATCH($B$11,Support!$A$3:'Support'!$D$3,0)-1,1,1)","v":"NE"},null,{"$f":"IF(OR(B12=\"TAIP\",E12=\"TAIP\")=TRUE,\"TAIP\",\"NE\")","v":"TAIP"}]
["Rangovo tipas","Ne PortalPRO"]
[null,{"$f":"OFFSET(Support!$A$3,1,MATCH($B$11,Support!$A$3:'Support'!$D$3,0)-1,1,1)","v":"NE"},{"$f":"OFFSET(Support!$A$7,1,MATCH($D$15,Support!$A$7:'Support'!$B$7,0)-1,1,1)","v":"12 men. (1m.)"},{"$f":"Support!$D$7","v":0.5}]
[null,{"$f":"IF(VLOOKUP(B11&B12,Support!F3:'Support'!G10,2,FALSE)=\"OK\",\"\",\"KLAIDA: Atvirkštinį PVM galima rinktis tik tuo atveju, jei rangovas yra PVM mokėtojas\")","v":""},{"$f":"Support!D220/$B$28","v":0.43541180544409896},{"$f":"IFERROR(IF(ROUND((IF(OR($B$11=\"PVM moketojas\",$B$11=\"PVM moketojas - PVM neapmokestinama veikla (ne rangos darbai)\"),$B$10*1.21+$E$10*1.21,$B$10+$E$10)*VLOOKUP($B$11,Support!$H$3:'Support'!$I$6,2,0)-$B$31-$B$32)/$B$28,2)>=$B$33,\"TAIP\",\"NE\"),\"NE\")","v":"TAIP"}]
[null,{"$f":"IF(VLOOKUP(B11&E12,Support!F3:'Support'!G10,2,FALSE)=\"OK\",\"\",\"KLAIDA: Atvirkštinį PVM galima rinktis tik tuo atveju, jei rangovas yra PVM mokėtojas\")","v":""},null,{"$f":"IF($B$35=\"Be issimokejimo termino\",\"NE\",\"TAIP\")","v":"TAIP"}]
[]
[]
[]
[null,"UZSAKOVO INFORMACIJA",null,null,null,null,null,null,"UŽSAKOVO INFORMACIJA"]
{"$rows_left_out":188}
{"sheet":"Issimokejimo grafikas","index":2,"n_rows":57,"n_cols":6,"rows_kept":57,"cut":false,"hidden":true,"merged":[[6,1,6,5],[0,2,0,5],[1,2,1,5],[4,3,4,5],[3,3,3,5],[2,3,2,5]]}
[null,null,"Pildomi laukai"]
[null,null,"Informacija apie paskolą"]
[null,null,"Mėnesiai",{"$f":"IF(Paraiska!B13=\"PortalPRO\",IF(Paraiska!B148=\"TAIP\",6,1),VLOOKUP(Paraiska!B35,Support!$A$18:$J$25,10,0))","v":36}]
[null,null,"Suma",{"$f":"IF(Paraiska!B13=\"PortalPRO\",Paraiska!D164,Paraiska!I85)","v":88874.22}]
[null,null,"Data","2021-04-25"]
[null,null,null,{"$f":"EOMONTH(C9,D3-1)","v":"2024-03-31"}]
[null,"Mokėjimų grafikas"]
[null,"Mėnesis","Kredito grąžinimo ir palūkanų mokėjimo data","Kredito likutis periodo pradžioje","Mokėtina suma","Kredito likutis periodo pabaigoje"]
[null,1,{"$f":"IF($B$9>$D$3,\"\",EOMONTH(D5,0))","v":"2021-04-30"},{"$f":"D4","v":88874.22},{"$f":"IF(C9=$D$6,D9,ROUND(IF($D$4/$D$3>D9,D9,$D$4/$D$3),2))","v":2468.73},{"$f":"D9-E9","v":86405.49}]
[null,2,{"$f":"IF(B10>$D$3,\"\",EOMONTH(C9,1))","v":"2021-05-31"},{"$f":"F9","v":86405.49},{"$f":"IF(C10=$D$6,D10,ROUND(IF($D$4/$D$3>D10,D10,$D$4/$D$3),2))","v":2468.73},{"$f":"D10-E10","v":83936.760000000009}]
[null,3,"2021-06-30",{"$f":"F10","v":83936.760000000009},2468.73,81468.030000000013]
[null,4,"2021-07-31",81468.030000000013,2468.73,78999.300000000017]
[null,5,"2021-08-31",78999.300000000017,2468.73,76530.570000000022]
[null,6,"2021-09-30",76530.570000000022,2468.73,74061.840000000026]
[null,7,"2021-10-31",74061.840000000026,2468.73,71593.11000000003]
[null,8,"2021-11-30",71593.11000000003,2468.73,69124.380000000034]
[null,9,"2021-12-31",69124.380000000034,2468.73,66655.650000000038]
[null,10,"2022-01-31",66655.650000000038,2468.73,64186.920000000035]
[null,11,"2022-02-28",64186.920000000035,2468.73,61718.190000000031]
[null,12,"2022-03-31",61718.190000000031,2468.73,59249.460000000028]
{"$rows_left_out":38}
{"sheet":"Darbu Sarasas","index":3,"n_rows":55,"n_cols":14,"rows_kept":55,"cut":false,"hidden":false,"merged":[]}
["Buhalterinė sąskaita NAV","DK sąskaita","Darbų pavadinimai","Atvirkštinis PVM","Garantija","Pasirinkti darbo tipą",null,"Atvirkštinis PVM","Garantija",null,1]
["Apsaugos sistemų montavimas","50108053","Apsaugos sistemų (pultinės ir vaizdo stebėjimo kamerų) įrengimas ir montavimas","Taikomas APVM","TAIP","Apsauginės, gaisrinės signalizacijos ir silpnų srovių sistemų instaliacijos, centralės keitimas, remontas","Signalizacijos (silpnos srovės) apsauginė ir gaisrinė","Taikomas APVM","TAIP",null,{"$f":"IF(I2=\"TAIP\",0,IF(I2=\"NE\",1,\"\"))","v":0},null,"Ar pasirinktas darbo tipas, kuriam netaikomas nei garantinis laikotarpis, nei draudimas?",{"$f":"IF(OR(Paraiska!$B$27='Darbu Sarasas'!$F$1,Paraiska!$B$27='Darbu Sarasas'!$F$20,Paraiska!$B$27='Darbu Sarasas'!$F$31,Paraiska!$B$27='Darbu Sarasas'!$F$36,Paraiska!$B$27='Darbu Sarasas'!$F$37,Paraiska!$B$27='Darbu Sarasas'!$F$38,Paraiska!$B$27='Darbu Sarasas'!$F$39,Paraiska!$B$27='Darbu Sarasas'!$F$54,Paraiska!$B$27='Darbu Sarasas'!$F$55),\"TAIP\",\"NE\")","v":"NE"}]
["Š.v. tiekimo ir kanalizavimo sistemų remontas","501087","Kanalizacijos ir nuotekos tinklų vamzdynų remontas","Taikomas APVM","TAIP","Apsaugos sistemų (pultinės ir vaizdo stebėjimo kamerų) įrengimas ir montavimas","Apsaugos sistemos","Taikomas APVM","TAIP",null,{"$f":"IF(I3=\"TAIP\",0,IF(I3=\"NE\",1,\"\"))","v":0},null,"Ar pasirinktas garantijos (draudimo) taikymas?",{"$f":"IF(OR(Paraiska!$B$52=Support!$N$31,Paraiska!$B$52=Support!$N$32),\"TAIP\",\"NE\")","v":"TAIP"}]
["Dujas deginančių įr. papild.","5010898","Dujotiekio sistemos vamzdynų ir įrangos remontas","Taikomas APVM","TAIP","Balkonų, terasų grindų ir konstrukcijų remontas","Išorės sienos (fasadai)","Taikomas APVM","TAIP",null,0,null,"Ar pasirinktos tinkamos darbų garantijos sąlygos, pagal pasirinktą darbo tipą?",{"$f":"IF(OR(AND($N$2=\"TAIP\",$N$3=\"TAIP\"),AND($N$2=\"NE\",$N$3=\"NE\")),\"NE\",\"TAIP\")","v":"TAIP"}]
["Elektros instaliacijos remontas","501089","Elektros skydinės renovacija, atnaujinimas","Taikomas APVM","TAIP","Dujotiekio sistemos vamzdynų ir įrangos remontas","Dujotiekis (katilinės)","Taikomas APVM","TAIP",null,0]
["Elektros instaliacijos remontas","501089","Laiptinės apšvietimo atnaujinimas (šviestuvai su davikliais)","Taikomas APVM","TAIP","Elektros skydinės renovacija, atnaujinimas","Elektra","Taikomas APVM","TAIP",null,0]
["Elektros instaliacijos remontas","501089","Laiptinės apskaitos skydelių atnaujinimas, remontas","Taikomas APVM","TAIP","Fasado mūro sienų atstatymas","Išorės sienos (fasadai)","Taikomas APVM","TAIP",null,0]
["Elektros instaliacijos remontas","501089","Magistralinių elektros instaliacijos laidų keitimas","Taikomas APVM","TAIP","Gaisrinių žarnų ir čiaupų patikra, perkantavimas ir bandymas","Priešgaisrinis vandentiekis","Taikomas APVM","TAIP",null,0]
["Elektros instaliacijos remontas","501089","Rūsio elektros instaliacijos, apšvietimo atnaujinimas, remontas","Taikomas APVM","TAIP","Įėjimo į laiptinę stogelio remontas","Įėjimo aikštelės, stogeliai","Taikomas APVM","TAIP",null,0]
["Elektros instaliacijos remontas","501089","Telefonspynės įrengimas","Taikomas APVM","TAIP","Laiptinių/rūsio įėjimo durų keitimas","Langai ir durys","Taikomas APVM","TAIP",null,0]
["Elektros instaliacijos remontas","501089","Kelio užtvaro, vartų automatikos remontas, įrengimas","Taikomas APVM","TAIP","Pastatų išorės sienų, stogų, balkonų, inžinierinių sistemų renovacija ir atnaujinimas","Pastatų renovacijos darbai","Taikomas APVM","TAIP",null,0]
["Staliaus ir bendrastatybiniai","501088","Laiptinės įėjimo aikštelės, laiptų remontas","Taikomas APVM","TAIP","Pastatų išorės sienų siūlių hermetizavimas","Išorės sienos (fasadai)","Taikomas APVM","TAIP",null,0]
["Staliaus ir bendrastatybiniai","501088","Įėjimo į laiptinę stogelio remontas","Taikomas APVM","TAIP","Išorės sienų (fasado) apdailos remonto darbai","Išorės sienos (fasadai)","Taikomas APVM","TAIP",null,0]
["Staliaus ir bendrastatybiniai","501088","Projektavimo darbai (išorės sienos (fasadai), balkonai, perdangos)","Netaikomas APVM","NE","Išorės sienų (fasado) šiltinimo darbai","Išorės sienos (fasadai)","Taikomas APVM","TAIP",null,0]
["Staliaus ir bendrastatybiniai","501088","Pastato konstrukcijų būklės vertinimas","Netaikomas APVM","NE","Kaminų, vėdinimo šachtų remontas","Kaminai, vėdinimo šachtos","Taikomas APVM","TAIP",null,0]
["Staliaus ir bendrastatybiniai","501088","Išorės sienų (fasado) apdailos remonto darbai","Taikomas APVM","TAIP","Kanalizacijos ir nuotekos tinklų vamzdynų remontas","Buitinės ir lietaus nuotekos","Taikomas APVM","TAIP",null,0]
["Staliaus ir bendrastatybiniai","501088","Išorės sienų (fasado) šiltinimo darbai","Taikomas APVM","TAIP","Karšto vandens, cirkuliacinio ir šildymo magistralinių vamzdžių keitimo darbai","Šildymo ir karšto vandens sistemos","Taikomas APVM","TAIP",null,0]
["Staliaus ir bendrastatybiniai","501088","Fasado mūro sienų atstatymas","Taikomas APVM","TAIP","Kelio užtvaro montavimas (bendrastatybinė dalys)","Teritorija","Taikomas APVM","TAIP",null,0]
["Staliaus ir bendrastatybiniai","501088","Balkonų, terasų grindų ir konstrukcijų remontas","Taikomas APVM","TAIP","Kelio užtvaro, vartų automatikos remontas, įrengimas","Elektra","Taikomas APVM","TAIP",null,0]
["Siūlių remontas","501083","Pastatų išorės sienų siūlių hermetizavimas","Taikomas APVM","TAIP","Kondicionavimo sistemų papildymas šaldymo skysčiu","Vėdinimo ir oro kondicionavimo sistemos","Netaikomas APVM","NE",null,1]
{"$rows_left_out":35}