{"text_format":"1","workbook":"xlsx","n_sheets":4,"sheets":["Support","Paraiska","Issimokejimo grafikas","Darbu Sarasas"],"not_rendered":{"charts":0,"images":0,"macros":1,"external_links":0,"defined_names":0,"comments":0,"pivot_tables":0},"unopened":[],"bounds":{"document_bytes":16777216,"sheet_cells":100000,"rows_first":2000,"rows_last":500,"rows_between":2000,"halvings":0,"cell_chars":16384,"cell_head_chars":4096},"cells_cut":0,"cells_raw":0,"read":"whole","date_system":"1900"}

{"sheet":"Support","index":0,"n_rows":103,"n_cols":16,"rows_kept":103,"cut":false,"hidden":true,"merged":[[77,1,81,1],[77,2,81,2],[77,3,81,3],[36,1,40,1],[36,2,40,2],[36,3,40,3],[56,1,60,1],[56,2,60,2],[56,3,60,3]]}
[null,"Pasirinkimas"]
[]
["PVM moketojas","PVM moketojas - PVM neapmokestinama veikla, ne rangos darbai","Ne PVM moketojas - rangos darbai","Ne PVM moketojas - PVM neapmokestinama veikla, ne rangos darbai",null,"PVM moketojasTAIP","OK","PVM moketojas",1.2,1.21]
["NE","NE","NE","NE",null,"PVM moketojasNE","OK","PVM moketojas - PVM neapmokestinama veikla, ne rangos darbai",1.2,1.21]
["TAIP",null,null,null,null,"Ne PVM moketojas - rangos darbaiNE","OK","Ne PVM moketojas - rangos darbai",{"$f":"1.242","v":1.242},1]
[null,null,null,null,null,"Ne PVM moketojas - rangos darbaiTAIP","NE","Ne PVM moketojas - PVM neapmokestinama veikla, ne rangos darbai",1.5,1]
["TAIP","NE","Minimali kaina kv.m., EUR",0.5,null,"PVM moketojas - PVM neapmokestinama veikla, ne rangos darbaiNE","OK"]
["12 men. (1m.)","Be issimokejimo termino","Minimali nemokumo riba",0.05,null,"PVM moketojas - PVM neapmokestinama veikla, ne rangos darbaiTAIP","NE"]
["18 men. (1.5m.)",null,null,null,null,"Ne PVM moketojas - PVM neapmokestinama veikla, ne rangos darbaiNE","OK"]
["24 men. (2m.)",null,null,null,null,"Ne PVM moketojas - PVM neapmokestinama veikla, ne rangos darbaiTAIP","NE"]
["30 men. (2.5m.)"]
["36 men. (3m.)"]
["42 men. (3.5m.)"]
["48 men. (4m.)",null,null,null,null,null,null,null,null,null,null,null,null,null,"Pirkimai","CS2021P"]
[null,null,null,null,null,null,null,null,null,null,null,null,null,null,"Bendra","CSSE48"]
[null,"1-5",null,6,null,7,null,null,null,null,8]
["issimokejimo terminas","Mokestis, %","Min. mokestis, EUR","Mokestis, %","Min. mokestis, EUR","Mokestis, %","Faktoringo kaina","Garantija","Reiksmes","Menesiai","Nemokumo koef"]
["Be issimokejimo termino",0.2,0,0,0,0,0,0.04,"NE",1,0]
["12 men. (1m.)",0.13,300,0.02,100,0.05,7.6316491272950537E-2,0.04,"TAIP",12,0.5]
["18 men. (1.5m.)",0.121,300,0.02,100,7.0999999999999994E-2,0.10270034785286498,0.04,"TAIP",18,0.5]
["24 men. (2m.)",0.113,300,0.02,100,0.09,0.12305037125973285,0.04,"TAIP",24,0.5]
["30 men. (2.5m.)",0.104,300,0.02,100,0.108,0.13713406506233672,0.04,"TAIP",30,0.5]
["36 men. (3m.)",9.6000000000000002E-2,300,0.02,100,0.123,0.14479037575786446,0.04,"TAIP",36,0.5]
["42 men. (3.5m.)",8.7999999999999995E-2,300,0.02,100,0.13800000000000001,0.16946973604135224,0.04,"TAIP",42,0.5]
["48 men. (4m.)",0.08,300,0.02,100,0.15,0.19448203394884239,0.04,"TAIP",48,0.5]
[]
[]
[null,"Bendras"]
[]
["Finansuotojas finansuoja rangovo saskaita"]
[]
["Tarpine rangovo saskaita (skirta faktoringo kainos apskaičiavimui)","Suma","PVM","Suma su PVM"]
[null,{"$f":"IF(OR(Paraiska!B11=\"PVM moketojas\",Paraiska!B11=\"PVM moketojas - PVM neapmokestinama veikla, ne rangos darbai\")=TRUE,Paraiska!B10+Paraiska!E10+B45,Paraiska!B10+Paraiska!E10+D45)","v":37500},{"$f":"IF(OR(Paraiska!B11=\"PVM moketojas\",Paraiska!B11=\"PVM moketojas - PVM neapmokestinama veikla, ne rangos darbai\")=TRUE,B33*0.21,0)","v":7875},{"$f":"SUM(B33,C33)","v":45375}]
[]
[]
[null,"Suma","PVM","Suma su PVM"]
["1 - Techninis konsultavimas del optimalaus darbu įgyvendinimo",{"$f":"ROUND(MAX(VLOOKUP(Paraiska!B35,A18:C25,2,0)*(Paraiska!B10+Paraiska!E10),VLOOKUP(Paraiska!B35,A18:C25,3,0)),2)","v":2400},{"$f":"ROUND(B37*0.21,2)","v":504},{"$f":"B37+C37","v":2904}]
["2 - Projektines uzduoties parengimas, siekiant Rangovui tinkamai pateikti pirkimo pasiulyma"]
["3 - Rangovu atliktu darbu garantiniu įsipareigojimu organizavimas"]
["4 - Rangovu sertifikavimas (patikimu tiekeju sarasas)"]
{"$rows_left_out":64}
{"sheet":"Paraiska","index":1,"n_rows":170,"n_cols":22,"rows_kept":170,"cut":false,"hidden":false,"merged":[[62,1,62,6],[57,4,57,6],[8,4,8,6],[8,1,8,3],[0,1,0,6],[12,1,12,6],[25,1,25,3],[25,4,25,6],[132,4,132,6],[3,1,3,6],[5,1,5,6],[76,1,76,3],[70,1,70,3],[69,1,69,3],[77,4,77,6],[76,4,76,6],[75,4,75,6],[71,4,71,6],[70,4,70,6],[69,4,69,6],[81,1,81,6],[74,1,74,6],[86,1,86,3],[91,4,91,6],[153,1,153,3],[155,4,155,6],[154,4,154,6],[153,4,153,6],[110,1,110,6],[10,1,10,6],[9,4,9,6],[11,4,11,6],[7,1,7,6],[19,1,19,6],[21,1,21,6],[20,1,20,6],[22,1,22,6],[39,1,39,6],[68,1,68,6],[138,1,138,6],[137,1,137,6],[136,1,136,6],[135,1,135,6],[133,1,133,6],[134,1,134,6],[65,4,65,6],[64,4,64,6],[63,4,63,6],[77,1,77,3],[131,1,131,6],[152,1,152,6],[148,1,148,6],[146,1,146,6],[145,1,145,6],[144,1,144,6],[143,1,143,6],[142,1,142,6],[141,1,141,6],[140,1,140,6],[139,1,139,6],[147,1,147,6],[31,1,31,6],[30,1,30,6],[29,1,29,6],[28,1,28,6],[27,8,27,10],[154,1,154,3],[155,1,155,3],[132,1,132,3],[89,1,89,3],[88,1,88,3],[87,1,87,3],[87,4,87,6],[101,1,101,3],[86,4,86,6],[58,4,58,6],[59,4,59,6],[121,1,121,6],[120,1,120,6],[118,1,118,6],[117,1,117,6],[116,1,116,6],[114,1,114,6],[113,1,113,6],[112,1,112,6],[9,1,9,3],[11,1,11,3],[20,8,20,10],[25,8,25,10],[24,8,24,10],[23,8,23,10],[30,8,30,10],[58,1,58,3],[57,1,57,3],[57,8,57,10],[35,8,35,10],[32,8,32,10],[33,8,33,10],[23,1,23,6],[41,4,41,6],[24,1,24,6],[38,1,38,6],[35,1,35,6],[34,1,34,6],[22,8,22,10],[31,8,31,10],[21,8,21,10],[33,1,33,6],[32,1,32,6],[68,8,68,10],[65,8,65,10],[59,8,59,10],[54,8,54,10],[41,1,41,3],[42,8,42,10],[64,1,64,3],[63,1,63,3],[34,8,34,10],[64,8,64,10],[63,8,63,10],[65,1,65,3],[59,1,59,3],[41,8,41,10],[38,8,38,10],[39,8,39,10],[56,8,56,10],[42,1,42,3],[42,4,42,6],[54,1,54,6],[37,1,37,6],[36,1,36,6],[40,3,40,4],[56,1,56,6],[3,8,3,10],[62,8,62,10],[58,8,58,10],[117,8,117,10],[114,8,114,10],[113,8,113,10],[110,8,110,10],[82,8,82,10],[81,8,81,10],[89,8,89,10],[7,8,7,10],[9,8,9,10],[10,8,10,10],[11,8,11,10],[19,8,19,10],[28,8,28,10],[29,8,29,10],[77,8,77,10],[76,8,76,10],[91,8,91,10],[111,8,111,10],[84,8,84,10],[88,8,88,10],[87,8,87,10],[192,8,192,10],[70,8,70,10],[69,8,69,10],[153,8,153,10],[154,8,154,10],[155,8,155,10],[164,8,164,10],[137,8,137,10],[138,8,138,10],[139,8,139,10],[140,8,140,10],[141,8,141,10],[142,8,142,10],[143,8,143,10],[144,8,144,10],[145,8,145,10],[86,8,86,10],[85,8,85,10],[74,8,74,10],[75,8,75,10],[146,8,146,10],[147,8,147,10],[148,8,148,10],[152,8,152,10],[131,8,131,10],[132,8,132,10],[133,8,133,10],[134,8,134,10],[135,8,135,10],[136,8,136,10],[121,8,121,10],[120,8,120,10],[118,8,118,10],[116,8,116,10],[112,8,112,10],[75,1,75,3],[71,1,71,3],[71,8,71,10],[90,8,90,10],[83,8,83,10],[130,1,130,3],[130,4,130,6],[84,1,84,3],[83,1,83,3],[82,1,82,3],[85,4,85,6],[84,4,84,6],[83,4,83,6],[82,4,82,6],[111,1,111,6],[115,4,115,6],[90,4,90,6],[89,4,89,6],[88,4,88,6],[91,1,91,3],[90,1,90,3],[85,1,85,3]]}
[null,"Pildomi laukai"]
[]
[]
["PIRKIMAI","PILDOMA INDORMACIJA",null,null,null,null,null,null,"PILDOMA INDORMACIJA",null,null,null,null,null,null,null,null,null,null,null,null,"X"]
[]
["Įveskite skirtingų atliekamų darbų skaičių (skirtingų mišrių PVM arba garantijos taikymas)",1]
[]
[null,"RANGOVO INFORMACIJA",null,null,null,null,null,null,"RANGOVO INFORMACIJA"]
[null,null,null,null,"Darbas #2"]
["Rangovo gaunamos pajamos (be administratoriaus ir faktoringo kaštų), EUR be PVM",30000,null,null,null,null,null,null,{"$f":"SUM(B10:G10)","v":30000}]
["Darbų vykdytojo PVM mokėtojo statusas","PVM moketojas",null,null,null,null,null,null,{"$f":"B11","v":"PVM moketojas"}]
["Ar taikomas atvirkštinis PVM? Pasirinkite reikšmę NE arba TAIP (galima tik kai rangovas yra PVM mokėtojas)","TAIP",{"$f":"OFFSET(Support!$A$3,1,MATCH($B$11,Support!$A$3:'Support'!$D$3,0)-1,1,1)","v":"NE"},{"$f":"OFFSET(Support!$A$3,1,MATCH($B$11,Support!$A$3:'Support'!$D$3,0)-1,1,1)","v":"NE"},{"$f":"OFFSET(Support!$A$3,1,MATCH($B$11,Support!$A$3:'Support'!$D$3,0)-1,1,1)","v":"NE"},{"$f":"OFFSET(Support!$A$3,1,MATCH($B$11,Support!$A$3:'Support'!$D$3,0)-1,1,1)","v":"NE"},{"$f":"OFFSET(Support!$A$3,1,MATCH($B$11,Support!$A$3:'Support'!$D$3,0)-1,1,1)","v":"NE"},null,{"$f":"IF(OR(B12=\"TAIP\",E12=\"TAIP\")=TRUE,\"TAIP\",\"NE\")","v":"TAIP"}]
["Rangovo tipas","Ne PortalPRO"]
[null,{"$f":"OFFSET(Support!$A$3,1,MATCH($B$11,Support!$A$3:'Support'!$D$3,0)-1,1,1)","v":"NE"},{"$f":"OFFSET(Support!$A$7,1,MATCH($B$34,Support!$A$7:'Support'!$B$7,0)-1,1,1)","v":"12 men. (1m.)"},{"$f":"Support!$D$7","v":0.5}]
[null,{"$f":"IF(VLOOKUP(B11&B12,Support!F3:'Support'!G10,2,FALSE)=\"OK\",\"\",\"KLAIDA: Atvirkštinį PVM galima rinktis tik tuo atveju, jei rangovas yra PVM mokėtojas\")","v":""}]
[null,{"$f":"IF(VLOOKUP(B11&E12,Support!F3:'Support'!G10,2,FALSE)=\"OK\",\"\",\"KLAIDA: Atvirkštinį PVM galima rinktis tik tuo atveju, jei rangovas yra PVM mokėtojas\")","v":""}]
[]
[]
[]
[null,"UZSAKOVO INFORMACIJA",null,null,null,null,null,null,"UŽSAKOVO INFORMACIJA"]
["Administratoriaus pavadinimas","UAB „Mano Bustas Siauliai“",null,null,null,null,null,null,{"$f":"IF(B21=0,\"\",B21)","v":"UAB „Mano Bustas Siauliai“"}]
["Iniciatorius","Asta Daugėlė",null,null,null,null,null,null,{"$f":"IF(B22=0,\"\",B22)","v":"Asta Daugėlė"}]
["Unikalus pranešimo numeris","V21-1083579"]
["Namo valdymo forma","Namo administratorius",null,null,null,null,null,null,{"$f":"IF(B24=0,\"\",B24)","v":"Namo administratorius"}]
["Namo adresas","Gegužių 80, Šiauliai",null,null,null,null,null,null,{"$f":"IF(B25=0,\"\",B25)","v":"Gegužių 80, Šiauliai"}]
["Darbо tipas","namo blokų padengimas termokeramika ",null,null,null,null,null,null,{"$f":"CONCATENATE(B26,,\";\",\" \",E26)","v":"namo blokų padengimas termokeramika ; "}]
["Rezervas"]
["Rezervas"]
["Naudingas namo/laiptinės plotas, kv. m",2322.88,null,null,null,null,null,null,{"$f":"B29","v":2322.88}]
["Namo/laiptinės butų skaičius, vnt.",35,null,null,null,null,null,null,{"$f":"IF(B30=0,\"\",B30)","v":35}]
["Panaudojama kaupiamųjų lėšų suma",0,null,null,null,null,null,null,{"$f":"IF(B31=0,\"\",B31)","v":""}]
["Panaudojamos kitos iš anksto sumokamos sumos, Eur",0,null,null,null,null,null,null,{"$f":"IF(B32=0,\"\",B32)","v":""}]
["Minimali darbų kaina vienam kv.m. taikant išsimokėjimą",1.5,null,null,null,null,null,null,1.5]
["Ar darbams suteikiamas išsimokėjimo terminas?",{"$f":"IFERROR(IF((B10+E10-B31-B32)/B29>(B33/VLOOKUP(B11,Support!$H$3:'Support'!$I$6,2,0)/VLOOKUP(B11,Support!$H$3:'Support'!$J$6,3,0)),\"TAIP\",\"NE\"),\"NE\")","v":"TAIP"},null,null,null,null,null,null,"TAIP"]
["Išsimokėjimo terminas (paskaičiuojamas automatiškai)","48 men. (4m.)",{"$f":"OFFSET(Support!$A$7,1,MATCH($B$34,Support!$A$7:'Support'!$B$7,0)-1,1,1)","v":"12 men. (1m.)"},{"$f":"OFFSET(Support!$A$7,1,MATCH($B$34,Support!$A$7:'Support'!$B$7,0)-1,1,1)","v":"12 men. (1m.)"},{"$f":"OFFSET(Support!$A$7,1,MATCH($B$34,Support!$A$7:'Support'!$B$7,0)-1,1,1)","v":"12 men. (1m.)"},{"$f":"OFFSET(Support!$A$7,1,MATCH($B$34,Support!$A$7:'Support'!$B$7,0)-1,1,1)","v":"12 men. (1m.)"},{"$f":"OFFSET(Support!$A$7,1,MATCH($B$34,Support!$A$7:'Support'!$B$7,0)-1,1,1)","v":"12 men. (1m.)"},null,"48 men. (4m.)"]
["Objekto nemokumas, %",1.2999999999999999E-2,null,null,null,null,null,null,1.2999999999999999E-2]
["Rezervas"]
["Rezervas"]
["Faktoringo kaina, %",{"$f":"VLOOKUP(B35,Support!A18:'Support'!G25,7,0)","v":0.19448203394884239},null,null,null,null,null,null,{"$f":"B39","v":0.19448203394884239}]
["Faktoringo kaina + PVM, EUR",{"$f":"SUM(B72:G72)","v":10677.79},null,null,null,null,null,null,{"$f":"B40","v":10677.79}]
{"$rows_left_out":131}
{"sheet":"Issimokejimo grafikas","index":2,"n_rows":57,"n_cols":6,"rows_kept":57,"cut":false,"hidden":false,"merged":[[6,1,6,5],[0,2,0,5],[1,2,1,5],[4,3,4,5],[3,3,3,5],[2,3,2,5]]}
[null,null,"Pildomi laukai"]
[null,null,"Informacija apie paskolą"]
[null,null,"Mėnesiai",{"$f":"IF(Paraiska!B13=\"PortalPRO\",IF(Paraiska!B148=\"TAIP\",6,1),VLOOKUP(Paraiska!B35,Support!$A$18:$J$25,10,0))","v":48}]
[null,null,"Suma",{"$f":"IF(Paraiska!B13=\"PortalPRO\",Paraiska!D164,Paraiska!I85)","v":56052.79}]
[null,null,"Data","2021-04-25"]
[null,null,null,{"$f":"EOMONTH(C9,D3-1)","v":"2025-03-31"}]
[null,"Mokėjimų grafikas"]
[null,"Mėnesis","Kredito grąžinimo ir palūkanų mokėjimo data","Kredito likutis periodo pradžioje","Mokėtina suma","Kredito likutis periodo pabaigoje"]
[null,1,{"$f":"IF($B$9>$D$3,\"\",EOMONTH(D5,0))","v":"2021-04-30"},{"$f":"D4","v":56052.79},{"$f":"IF(C9=$D$6,D9,ROUND(IF($D$4/$D$3>D9,D9,$D$4/$D$3),2))","v":1167.77},{"$f":"D9-E9","v":54885.020000000004}]
[null,2,{"$f":"IF(B10>$D$3,\"\",EOMONTH(C9,1))","v":"2021-05-31"},{"$f":"F9","v":54885.020000000004},{"$f":"IF(C10=$D$6,D10,ROUND(IF($D$4/$D$3>D10,D10,$D$4/$D$3),2))","v":1167.77},{"$f":"D10-E10","v":53717.250000000007}]
[null,3,"2021-06-30",{"$f":"F10","v":53717.250000000007},1167.77,52549.48000000001]
[null,4,"2021-07-31",52549.48000000001,1167.77,51381.710000000014]
[null,5,"2021-08-31",51381.710000000014,1167.77,50213.940000000017]
[null,6,"2021-09-30",50213.940000000017,1167.77,49046.17000000002]
[null,7,"2021-10-31",49046.17000000002,1167.77,47878.400000000023]
[null,8,"2021-11-30",47878.400000000023,1167.77,46710.630000000026]
[null,9,"2021-12-31",46710.630000000026,1167.77,45542.86000000003]
[null,10,"2022-01-31",45542.86000000003,1167.77,44375.090000000033]
[null,11,"2022-02-28",44375.090000000033,1167.77,43207.320000000036]
[null,12,"2022-03-31",43207.320000000036,1167.77,42039.550000000039]
[null,13,"2022-04-30",42039.550000000039,1167.77,40871.780000000042]
[null,14,"2022-05-31",40871.780000000042,1167.77,39704.010000000046]
[null,15,"2022-06-30",39704.010000000046,1167.77,38536.240000000049]
[null,16,"2022-07-31",38536.240000000049,1167.77,37368.470000000052]
[null,17,"2022-08-31",37368.470000000052,1167.77,36200.700000000055]
[null,18,"2022-09-30",36200.700000000055,1167.77,35032.930000000058]
[null,19,"2022-10-31",35032.930000000058,1167.77,33865.160000000062]
[null,20,"2022-11-30",33865.160000000062,1167.77,32697.390000000061]
[null,21,"2022-12-31",32697.390000000061,1167.77,31529.620000000061]
[null,22,"2023-01-31",31529.620000000061,1167.77,30361.85000000006]
[null,23,"2023-02-28",30361.85000000006,1167.77,29194.08000000006]
[null,24,"2023-03-31",29194.08000000006,1167.77,28026.31000000006]
[null,25,"2023-04-30",28026.31000000006,1167.77,26858.540000000059]
[null,26,"2023-05-31",26858.540000000059,1167.77,25690.770000000059]
[null,27,"2023-06-30",25690.770000000059,1167.77,24523.000000000058]
[null,28,"2023-07-31",24523.000000000058,1167.77,23355.230000000058]
[null,29,"2023-08-31",23355.230000000058,1167.77,22187.460000000057]
[null,30,"2023-09-30",22187.460000000057,1167.77,21019.690000000057]
[null,31,"2023-10-31",21019.690000000057,1167.77,19851.920000000056]
[null,32,"2023-11-30",19851.920000000056,1167.77,18684.150000000056]
{"$rows_left_out":18}
{"sheet":"Darbu Sarasas","index":3,"n_rows":53,"n_cols":5,"rows_kept":53,"cut":false,"hidden":false,"merged":[]}
["Grupė","Buhalterinė sąskaita NAV","DK sąskaita","Darbų pavadinimai","Atvirkštinis PVM"]
["Elektra","Elektros instaliacijos remontas","501089","Elektros skydinės renovacija, atnaujinimas","Taikomas APVM"]
["Elektra","Elektros instaliacijos remontas","501089","Laiptinės apšvietimo atnaujinimas( šviestuvai su davikliais)","Taikomas APVM"]
["Elektra","Elektros instaliacijos remontas","501089","Laiptinės apskaitos skydelių atnaujinimas, remontas","Taikomas APVM"]
["Elektra","Elektros instaliacijos remontas","501089","Magistralinių elektros instaliacijos laidų keitimas","Taikomas APVM"]
["Elektra","Elektros instaliacijos remontas","501089","Rūsio elektros instaliacijos, apšvietimo atnaujinimas, remontas","Taikomas APVM"]
["Elektra","Elektros instaliacijos remontas","501089","Telefonspynės įrengimas","Taikomas APVM"]
["Elektra","Elektros instaliacijos remontas","501089","Kelio užtvaro, vartų automatikos remontas, įrengimas","Taikomas APVM"]
["Stogai","Stogo remontas","501081","Prylydomos stogo dangos keitimas, apšiltinimas","Taikomas APVM"]
["Stogai","Stogo remontas","501081","Stogo dangos ir konstrukcijų kapitalinis remontas","Taikomas APVM"]
["Stogai","Stogo remontas","501081","Šlaitinio stogo dangos keitimas ( šerpinės, šiferio, plieninio)","Taikomas APVM"]
["Stogai","Stogo remontas","501081","Lietaus nuvedimo sitemos keitimas( latakai, lietvamzdžiai)","Taikomas APVM"]
["Kaminai, vėdinimo šachtos","Stogo remontas","501081","Kaminų, vėdinimo šachtų remontas","Taikomas APVM"]
["Stogai","Stogo remontas","501081","Projektavimo darbai (stogai)","Netaikomas APVM"]
["Išorės sienos ( fasadai)","Staliaus ir bendrastatybiniai","501088","Išorės sienų (fasado) apdailos remonto darbai","Taikomas APVM"]
["Išorės sienos ( fasadai)","Staliaus ir bendrastatybiniai","501088","Išorės sienų (fasado) šiltinimo darbai","Taikomas APVM"]
["Išorės sienos ( fasadai)","Staliaus ir bendrastatybiniai","501088","Fasado mūro sienų atstatymas","Taikomas APVM"]
["Išorės sienos ( fasadai)","Staliaus ir bendrastatybiniai","501088","Balkonų, terasų grindų ir konstrukcijų, remontas","Taikomas APVM"]
["Išorės sienos ( fasadai)","Staliaus ir bendrastatybiniai","501088","Projektavimo darbai ( išorės sienos (fasadai), balkonai, perdangos)","Netaikomas APVM"]
["Išorės sienos ( fasadai)","Staliaus ir bendrastatybiniai","501088","Pastato konstrukcijų būklės vertinimas","Netaikomas APVM"]
["Išorės sienos ( fasadai)","Siūlių remontas","501083","Išorės pastatų sienų siūlių hermetizavimas","Taikomas APVM"]
["Išorės sienos ( fasadai)","Siūlių remontas","501083","Tarpblokinių siūlių hermetizavimas","Taikomas APVM"]
["Įėjimo aikštelės, stogeliai","Staliaus ir bendrastatybiniai","501088","Laiptinės įėjimo aikštelės, laiptų remontas","Taikomas APVM"]
["Įėjimo aikštelės, stogeliai","Staliaus ir bendrastatybiniai","501088","Įėjimo į laiptinė stogelio remontas","Taikomas APVM"]
["Nuogrinda","Staliaus ir bendrastatybiniai","501088","Pastato nuogrindos įrengimas, remontas","Taikomas APVM"]
["Teritorija","Staliaus ir bendrastatybiniai","501088","Kelio užtvaro montavimas ( bendrastatybinė dalys)","Taikomas APVM"]
["Pastatų vidaus paviršiai","Laiptinių priežiūra ir remontas","501085","Pastatų vidaus paviršių apdailos remontas ( dažymas, tinkavimas)","Taikomas APVM"]
["Pastatų vidaus paviršiai","Laiptinių priežiūra ir remontas","501085","Laipinės dekoratyvinių tinko apdaila","Taikomas APVM"]
["Signalizacijos ( silpnos srovės) apsauginė ir gaisrinė","Pultinė apsauga","5010896","Apsauginės, gaisrinės signalizacijos ir silpnų srovių sistemų instaliacijos, centralės keitimas, remontas","Taikomas APVM"]
["Apsaugos sistemos","Apsaugos sistemų montavimas","50108053","Apsaugos sistemų (pultinės ir vaizdo stebėjimo kamerų) įrengimas ir montavimas","Taikomas APVM"]
["Dujotiekis ( katilinės)","Dujas deginančių įr. papild.","5010898","Dujotiekio sistemos vamzdynų ir įrangos remontas","Taikomas APVM"]
["Langai ir durys","Langų/durų keitimas","501084","Įėjimo laiptinių/rūsio durų keitimas","Taikomas APVM"]
["Langai ir durys","Langų/durų keitimas","501084","Laiptinės langų keitimas","Taikomas APVM"]
["Langai ir durys","Langų/durų keitimas","501084","Plienininių laiptinės durų su telefonspynė montavimas","Taikomas APVM"]
["Liftai","Liftų remontas","5010801","Liftų įrangos ir pritaisų keitimas, remontas","Netaikomas APVM"]
["Liftai","Liftų remontas","5010801","Liftų montavimas, modernizavimas (nauji liftai)","Taikomas APVM"]
["Priešgaisrinis vandentiekis","Priešgaisrinių sistemų papild.","5010897","Priešgaisrinio vandentiekio sistemos vamzdyno ir čiaupų remontas","Taikomas APVM"]
["Priešgaisrinis vandentiekis","Priešgaisrinių sistemų papild.","5010897","Gaisrinių žarnų ir čiaupų patikra, perkantavimas ir bandymas","Taikomas APVM"]
["Šaltas vandens ir nuotekų tinklai","Š.v. tiekimo ir kanalizavimo sistemų remontas","501087","Šaltas vandens ir nuotekos tinklų vamzdynų remontas","Taikomas APVM"]
["Šaltas vandens ir nuotekų tinklai","Š.v. tiekimo ir kanalizavimo sistemų remontas","501087","Projektavimo darbai ( šalto vandens, buitinių ir lietas nuotekų sistemos)","Netaikomas APVM"]
{"$rows_left_out":13}